{"text_format":"3","workbook":"xlsx","n_sheets":11,"sheets":["ShortReport","CompleteReport","CONDITIONS","GEOMETRY","CALCOLI STS (slab to slab)","CLT EDGE DISTANCE","CONCRETE","CLT","SCREWS","traduzioni","Foglio1"],"not_rendered":{"charts":9,"images":56,"macros":1,"defined_names":13,"comments":1},"read":"whole","date_system":"1900"}

{"sheet":"ShortReport","index":0,"n_rows":133,"n_cols":1,"rows_kept":133,"merged":[[131,0,131,19],[132,0,132,19]]}
{"$rows_empty":127}
[{"$f":"traduzioni!A180","v":"NOTAS"}]
[{"$f":"traduzioni!A181","v":"Antes de la construcción, todos los cálculos deben ser comprobados y aprobados por el proyectista responsable."}]
[{"$f":"traduzioni!A182","v":"Los valores de resistencia mecánica y la geometría se refieren a la certificación del producto."}]
[{"$f":"traduzioni!A183","v":"La comprobación de la resistencia del sistema lado anclaje al hormigón deberá realizarse por separado siguiendo las indicaciones de ETA-22/0806 - Annex E1."}]
[{"$f":"traduzioni!A184","v":"Todos los cálculos deben ser comprobados y aprobados por el proyectista responsable antes de su ejecución. El proyectista tiene la obligación de comprobar en cada uso que los datos sean conformes con las normativas vigentes y con el proyecto. La responsabilidad final de elegir el producto apropiado para una aplicación específica recae en el proyectista."}]
[{"$f":"traduzioni!A185","v":"Los resultados obtenidos en esta ficha son de carácter indicativo y deben considerarse como un servicio técnico-comercial en el ámbito de la actividad de ventas de Rotho Blaas srl. El número y el espesor de las puntas deben ser determinados por el proyectista responsable, que tiene la obligación de comprobar la exactitud de los resultados obtenidos mediante el procesamiento de los datos introducidos. Rotho Blaas srl no garantiza la conformidad con la normativa vigente ni la proyección de los cálculos realizados mediante esta hoja de cálculo. En concreto, tras modificar las disposiciones pertinentes, como, por ejemplo, normas, aprobaciones, etc., el programa puede dejar de ser válido, parcial o completamente. Rotho Blaas srl no ofrece ninguna garantía y en ningún caso podrá ser considerado responsable por daños o consecuencias, directas o indirectas (garantía por defectos, garantía por mal funcionamiento, responsabilidad del producto o legal, etc.). El Usuario declara que utilizará la hoja de cálculo como profesional con la obligación y la responsabilidad de comprobar que la hoja de cálculo responda a sus necesidades específicas."}]

{"sheet":"CompleteReport","index":1,"n_rows":371,"n_cols":1,"rows_kept":371,"merged":[[369,0,369,19],[370,0,370,19]]}
{"$rows_empty":365}
[{"$f":"traduzioni!A180","v":"NOTAS"}]
[{"$f":"traduzioni!A181","v":"Antes de la construcción, todos los cálculos deben ser comprobados y aprobados por el proyectista responsable."}]
[{"$f":"traduzioni!A182","v":"Los valores de resistencia mecánica y la geometría se refieren a la certificación del producto."}]
[{"$f":"traduzioni!A183","v":"La comprobación de la resistencia del sistema lado anclaje al hormigón deberá realizarse por separado siguiendo las indicaciones de ETA-22/0806 - Annex E1."}]
[{"$f":"traduzioni!A184","v":"Todos los cálculos deben ser comprobados y aprobados por el proyectista responsable antes de su ejecución. El proyectista tiene la obligación de comprobar en cada uso que los datos sean conformes con las normativas vigentes y con el proyecto. La responsabilidad final de elegir el producto apropiado para una aplicación específica recae en el proyectista."}]
[{"$f":"traduzioni!A185","v":"Los resultados obtenidos en esta ficha son de carácter indicativo y deben considerarse como un servicio técnico-comercial en el ámbito de la actividad de ventas de Rotho Blaas srl. El número y el espesor de las puntas deben ser determinados por el proyectista responsable, que tiene la obligación de comprobar la exactitud de los resultados obtenidos mediante el procesamiento de los datos introducidos. Rotho Blaas srl no garantiza la conformidad con la normativa vigente ni la proyección de los cálculos realizados mediante esta hoja de cálculo. En concreto, tras modificar las disposiciones pertinentes, como, por ejemplo, normas, aprobaciones, etc., el programa puede dejar de ser válido, parcial o completamente. Rotho Blaas srl no ofrece ninguna garantía y en ningún caso podrá ser considerado responsable por daños o consecuencias, directas o indirectas (garantía por defectos, garantía por mal funcionamiento, responsabilidad del producto o legal, etc.). El Usuario declara que utilizará la hoja de cálculo como profesional con la obligación y la responsabilidad de comprobar que la hoja de cálculo responda a sus necesidades específicas."}]

{"sheet":"CONDITIONS","index":2,"n_rows":61,"n_cols":5,"rows_kept":61,"merged":[[1,3,3,3],[2,4,3,4],[6,2,8,4],[13,2,13,4],[17,2,17,4],[21,2,21,4],[25,2,25,4],[29,2,29,4],[33,2,33,4],[37,2,37,4],[41,2,41,4],[45,2,45,4],[49,2,49,4],[53,2,53,4],[57,2,57,4],[58,2,58,4],[60,0,62,5]]}
[]
[{"$nulls":3},"tc_fusion_calculator\nv.1.10",{"$f":"traduzioni!A216","v":"Idioma"}]
[{"$nulls":4},"ES"]
[]
[]
[{"$nulls":3},"TC-FUSION CALCULATOR"]
[null,null,{"$f":"traduzioni!A190","v":"CONDICIONES GENERALES DEL CONTRATO DE LICENCIA DE USO PARA LA HOJA DE CÁLCULO “TC_FUSION_CALCULATOR”"}]
[]
[]
[]
[]
[null,{"$f":"traduzioni!A191","v":"1. OBJETO"}]
[]
[null,null,{"$f":"traduzioni!A192","v":"Con estas Condiciones Generales (o “Contrato”), ROTHO BLAAS SRL, con domicilio en I-39040 Cortaccia (BZ), Via dell'Adige 2/1 (en lo sucesivo, “RB”), otorga al usuario el derecho no exclusivo y revocable para usar, a título gratuito, la hoja de cálculo “--” (en lo sucesivo, “CALC”) en las condiciones indicadas a continuación y mientras esté vigente el Contrato.\n\nPor lo tanto, este contrato tiene por objeto regular la relación entre el usuario y RB con respecto al uso de dicha hoja de cálculo. En el momento en que el usuario descarga y usa CALC, acepta este Contrato y las condiciones indicadas.\n\nCALC permite al usuario realizar cálculos estáticos exclusivamente para los productos y los materiales indicados en cada una de sus secciones. Este Contrato prohíbe expresamente el uso de CALC para realizar cálculos para productos que no estén indicados.\n\nEn cualquier caso, RB no proporciona ninguna garantía sobre la conformidad legal ni con el proyecto de cálculos y solo pretende proporcionar una herramienta de cálculo indicativo, como servicio técnico-comercial en el ámbito de la actividad de ventas."}]
[]
{"$rows_left_out":47}
{"sheet":"GEOMETRY","index":3,"n_rows":95,"n_cols":46,"rows_kept":95,"merged":[[1,4,5,9],[7,3,10,3],[8,7,8,10],[9,7,9,10],[10,7,10,10],[12,3,14,3],[18,3,27,3],[29,3,33,3],[31,7,31,9],[33,8,33,10],[35,3,48,3],[50,3,58,3],[53,10,55,10],[60,3,63,3],[65,3,75,3],[70,10,72,10],[74,37,74,40],[74,42,74,45],[77,3,83,3],[85,3,90,3],[92,3,94,3],[92,10,94,10]]}
[]
[{"$nulls":4},{"$f":"traduzioni!A4","v":"CÁLCULO TC FUSION"}]
[]
[]
[]
[{"$nulls":10},"tc_fusion_calculator v. 1.10"]
[]
[{"$nulls":3},{"$f":"traduzioni!A5","v":"Información general "},null,null,{"$f":"traduzioni!A6","v":"Fecha"},{"$f":"TODAY()","v":"2024-09-12"},null,{"$f":"traduzioni!A216","v":"Idioma"},"ES"]
[{"$nulls":6},{"$f":"traduzioni!A7","v":"Proyecto"}]
[{"$nulls":6},{"$f":"traduzioni!A8","v":"Proyectista"}]
[{"$nulls":6},{"$f":"traduzioni!A9","v":"Conexión n.º"}]
[]
[{"$nulls":3},{"$f":"traduzioni!A10","v":"Normativa"},null,null,"TC-FUSION","ETA-22/0806 (2023/05)"]
[{"$nulls":6},{"$f":"traduzioni!A224","v":"Madera"},"EC 1995-1-1:2014"]
[{"$nulls":6},{"$f":"traduzioni!A225","v":"Hormigón"},"EC 1992-1-1:2015"]
{"$rows_left_out":81}
{"sheet":"CALCOLI STS (slab to slab)","index":4,"n_rows":129,"n_cols":36,"rows_kept":129,"merged":[[1,3,13,3],[15,3,19,3],[17,7,17,10],[21,3,32,3],[35,3,43,3],[45,3,49,3],[51,3,58,3],[62,4,66,9],[68,27,68,30],[72,3,79,3],[81,3,90,3],[81,10,83,10],[92,3,96,3],[98,3,107,3],[109,3,128,3],[126,10,128,10]]}
[]
[{"$nulls":3},"Sollecitazione",null,null,"Durata carico",{"$f":"GEOMETRY!H19","v":"Corta/Instantánea"},{"$nulls":3},{"$f":"GEOMETRY!H14","v":"EC 1995-1-1:2014"}]
[]
[{"$nulls":4},"b",null,"Lunghezza giunto",{"$f":"GEOMETRY!H21","v":1000},null,"[mm]"]
[]
[{"$nulls":4},"Ny",null,"Azione assiale (perpendicolare al giunto)",{"$f":"GEOMETRY!H23","v":0},null,"[kN]/[m]"]
[{"$nulls":4},"Vx",null,"Taglio in piano",{"$f":"GEOMETRY!H24","v":0},null,"[kN]/[m]"]
[{"$nulls":4},"Vz",null,"Taglio fuoripiano",{"$f":"GEOMETRY!H25","v":0},null,"[kN]/[m]"]
[{"$nulls":4},"Mx",null,"Momento flettente (parallelo al giunto)",{"$f":"GEOMETRY!H26","v":11.9},null,"[kNm]/[m]"]
[{"$nulls":6},{"$f":"IF(H10=\"POS\",\"Fibre inferiori tese\", IF(H10=\"NEG\",\"Fibre superiori tese\",\"NO\"))","v":"Fibre inferiori tese"},{"$f":"GEOMETRY!H27","v":"POS"}]
[]
[]
[]
[{"$nulls":4},"Mxy ",null,"Torsione",{"$f":"GEOMETRY!H28","v":0},null,"[kNm]/[m]"]
[]
{"$rows_left_out":115}
{"sheet":"CLT EDGE DISTANCE","index":5,"n_rows":18,"n_cols":5,"rows_kept":18,"merged":[[3,1,4,1],[3,2,4,2],[8,2,9,4]]}
[]
[]
[]
[null,null,{"$f":"traduzioni!A155","v":"celdas editables"}]
[]
[]
[]
[]
[null,null,{"$f":"traduzioni!A156","v":"Distancia de la línea de tornillos bajos desde el borde CLT"}]
[]
[]
[null,null,{"$f":"CONCATENATE(traduzioni!A157,\" t\")","v":"Tabla t"},{"$f":"IF(GEOMETRY!H42=\"N\",0,GEOMETRY!I42)","v":0},"[mm]"]
[null,null,{"$f":"CONCATENATE(traduzioni!A158,\" c\")","v":"Posición barra longitudinal c"},{"$f":"CONCRETE!H20","v":24},"[mm]"]
[null,null,{"$f":"traduzioni!A159","v":"Barra longitudinal (1/2 diám.)"},{"$f":"0.5*'CALCOLI STS (slab to slab)'!H38","v":4},"[mm]"]
[null,null,{"$f":"traduzioni!A160","v":"Tolerancia en curvatura estribos"},2,"[mm]"]
{"$rows_left_out":4}
{"sheet":"CONCRETE","index":6,"n_rows":35,"n_cols":22,"rows_kept":35,"merged":[[3,1,4,1],[3,2,4,3],[8,16,8,21]]}
[]
[]
[]
[null,null,{"$f":"traduzioni!A162","v":"celdas editables"}]
[]
[]
[]
[]
[null,null,{"$f":"traduzioni!A164","v":"Clase de exposición ambiental"},{"$nulls":3},"XC1",{"$nulls":9},{"$f":"CONCATENATE(traduzioni!A223,\" [mm]\")","v":"Recubrimiento mínimo requerido [mm]"}]
[null,null,{"$f":"traduzioni!A165","v":"Clase estructural"},{"$nulls":3},"S3",{"$nulls":9},"Cl","X0","XC1","XC2","XC3","XC4"]
[{"$nulls":16},"S1",10,10,10,10,15]
[{"$nulls":3},"d",null,"cmin,b","cmin,dur",null,null,"Cmin","D,cdev",null,"c,nom",{"$nulls":3},"S2",10,10,15,15,20]
[{"$nulls":3},"[mm]",null,"[mm]","[mm]","[mm]",null,"[mm]","[mm]",null,"[mm]",{"$nulls":3},"S3",10,10,20,20,25]
[null,null,"d st",{"$f":"'CALCOLI STS (slab to slab)'!H37","v":6},null,{"$f":"D14+IF('CALCOLI STS (slab to slab)'!H39>32,5,0)","v":6},{"$f":"HLOOKUP(G9,R10:V16,MID(G10,2,1)+1,FALSE)","v":10},10,null,{"$f":"MAX(F14,G14,H14)","v":10},10,null,{"$f":"J14+K14","v":20},{"$nulls":3},"S4",10,15,25,25,30]
[null,null,"d_L",{"$f":"'CALCOLI STS (slab to slab)'!H38","v":8},null,{"$f":"D15+IF('CALCOLI STS (slab to slab)'!H39>32,5,0)","v":8},{"$f":"HLOOKUP(G9,R10:V16,MID(G10,2,1)+1,FALSE)","v":10},10,null,{"$f":"MAX(F15,G15,H15)","v":10},10,null,{"$f":"J15+K15","v":20},{"$nulls":3},"S5",15,20,30,30,35]
{"$rows_left_out":21}
{"sheet":"CLT","index":7,"n_rows":76,"n_cols":24,"rows_kept":76,"merged":[[3,4,4,4]]}
[]
[]
[]
[]
[{"$nulls":5},{"$f":"traduzioni!A169","v":"celdas editables"}]
[]
[]
[]
[{"$nulls":6},"fc0k","fc90k","ro","E0m","E90m",null,{"$f":"'CALCOLI STS (slab to slab)'!H16","v":"GL24h"},{"$nulls":9},{"$f":"traduzioni!A26","v":"Permanente"},0.6]
[{"$nulls":6},"[Mpa]","[Mpa]","[kg/mc]","[Mpa]","[Mpa]",{"$nulls":11},{"$f":"traduzioni!A27","v":"Larga"},0.7]
[{"$nulls":5},"C24",21,2.5,380,{"$f":"11000","v":11000},370,null,"ym",{"$f":"IF(GEOMETRY!H14=\"NTC 2018 (ITA)\",1.35,1.25)","v":1.25},"[-]",{"$nulls":7},{"$f":"traduzioni!A28","v":"Media"},0.8]
[{"$nulls":5},"GL24h",24,2.5,380,11500,300,null,"kmod",{"$f":"VLOOKUP('CALCOLI STS (slab to slab)'!H2,W9:X14,2,FALSE)","v":1},"[-]",{"$nulls":7},{"$f":"traduzioni!A29","v":"Corta"},0.9]
[{"$nulls":5},"user material",{"$nulls":4}," ",{"$nulls":11},{"$f":"traduzioni!A30","v":"Instantánea"},1.1]
[{"$nulls":12},"ro",{"$f":"VLOOKUP($M$9,$F$11:$K$13,4,FALSE)","v":380},"[kg/mc]",{"$nulls":7},{"$f":"traduzioni!A31","v":"Corta/Instantánea"},1]
[{"$nulls":12},"E0m",{"$f":"VLOOKUP($M$9,$F$11:$K$13,5,FALSE)","v":11500},"[Mpa]"]
{"$rows_left_out":62}
{"sheet":"SCREWS","index":8,"n_rows":98,"n_cols":53,"rows_kept":98,"merged":[[3,1,4,1],[24,1,25,5],[24,6,25,10],[36,1,37,5],[36,6,37,10],[51,2,51,4]]}
[]
[]
[]
[]
[null,null,{"$f":"traduzioni!A171","v":"celdas editables"}]
[]
[]
[{"$nulls":29},"legno",{"$nulls":4},"leff min (duct)","leff min (e)"]
[null,null,"SCREWS",null,null,"d","Ftens","fbk","MY","fuk","dn",null,{"$f":"traduzioni!A172","v":"coef. conexión madera"},{"$nulls":16},"ym",{"$f":"IF('CALCOLI STS (slab to slab)'!L2=\"NTC 2018 (ITA)\",1.4,1.35)","v":1.35},"[-]",null,{"$f":"((20*F11^-0.5))","v":{"v":6.666666666666666,"d":"6.7"}},{"$f":"2.3*(I11*1000/(20*F11^-0.5*F11))^0.5","v":{"v":48.97073956285869,"d":"49.0"}}]
[{"$nulls":5},"[mm]","[kN]","[MPa]","[Nm]","[MPa]","[mm]",null,"ym",{"$f":"IF('CALCOLI STS (slab to slab)'!L2=\"NTC 2018 (ITA)\",1.4,1.3)","v":1.3},"[-]",{"$nulls":14},"kmod",{"$f":"VLOOKUP('CALCOLI STS (slab to slab)'!H2,CLT!W9:X14,2,FALSE)","v":1},"[-]",null,{"$f":"((20*F12^-0.5))","v":{"v":6.030226891555273,"d":"6.0"}},{"$f":"2.3*(I12*1000/(20*F12^-0.5*F12))^0.5","v":{"v":60.502178096441845,"d":"60.5"}}]
[null,null,"VGS",null,{"$f":"_xlfn.CONCAT(C11,\"_\",F11)","v":"VGS_9"},9,25.4,12.5,27.2,1000,5.9,null,"kmod",{"$f":"VLOOKUP('CALCOLI STS (slab to slab)'!H2,CLT!W9:X14,2,FALSE)","v":1},"[-]",{"$nulls":14},"ymconn",{"$f":"IF('CALCOLI STS (slab to slab)'!L2=\"NTC 2018 (ITA)\",1.4,1.3)","v":1.3},"[-]",null,{"$f":"((20*F13^-0.5))","v":{"v":5.547001962252292,"d":"5.5"}},{"$f":"2.3*(I13*1000/(20*F13^-0.5*F13))^0.5","v":{"v":72.11906999823809,"d":"72.1"}}]
[{"$nulls":4},{"$f":"_xlfn.CONCAT(C11,\"_\",F12)","v":"VGS_11"},11,38,12.5,45.9,1000,6.6,{"$nulls":22},{"$f":"((20*F14^-0.5))","v":{"v":5,"d":"5.0"}},{"$f":"2.3*(I14*1000/(20*F14^-0.5*F14))^0.5","v":{"v":114.99999999999999,"d":"115.0"}}]
[{"$nulls":4},{"$f":"_xlfn.CONCAT(C11,\"_\",F13)","v":"VGS_13"},13,53,12.5,70.9,1000,8,null,{"$f":"traduzioni!A173","v":"coef. material acero"},{"$nulls":16},"acciaio (trazione)"]
[null,null,"RTR",null,{"$f":"_xlfn.CONCAT(C14,\"_\",F14)","v":"RTR_16"},16,100,9,200,650,12,null,"ym",{"$f":"IF('CALCOLI STS (slab to slab)'!L2=\"NTC 2018 (ITA)\",1.25,1.25)","v":1.25},"[-]",{"$nulls":14},"ym",{"$f":"IF('CALCOLI STS (slab to slab)'!L2=\"NTC 2018 (ITA)\",1.25,1.25)","v":1.25},"[-]"]
[]
{"$rows_left_out":84}
{"sheet":"traduzioni","index":9,"n_rows":226,"n_cols":9,"rows_kept":226,"hidden":true}
["lingua selezionata:",{"$f":"GEOMETRY!K8","v":"ES"},null,"IT","EN","DE","ES","FR","PT"]
[]
[{"$f":"IF($B$1=$D$1,D3,IF($B$1=$E$1,E3,IF($B$1=$F$1,F3,IF($B$1=$G$1,G3,IF($B$1=$H$1,H3,IF($B$1=$I$1,I3,\"ERROR\"))))))","v":"Idioma"},null,null,"Lingua","Language","Sprache","Idioma","Langue","Idioma"]
[{"$f":"IF($B$1=$D$1,D4,IF($B$1=$E$1,E4,IF($B$1=$F$1,F4,IF($B$1=$G$1,G4,IF($B$1=$H$1,H4,IF($B$1=$I$1,I4,\"ERROR\"))))))","v":"CÁLCULO TC FUSION"},null,null,"CALCOLO TC-FUSION","TC-FUSION CALCULATION","BERECHNUNG TC FUSION","CÁLCULO TC FUSION","CALCUL TC-FUSION","CÁLCULO TC-FUSION"]
["Información general ",null,null,"Informazioni generali ","General informations","Allgemeine Informationen ","Información general ","Informations générales ","Informações gerais "]
["Fecha",null,null,"Data","Date","Datum","Fecha","Date","Data"]
["Proyecto",null,null,"Progetto","Project","Projekt","Proyecto","Projet","Projeto"]
["Proyectista",null,null,"Progettista","Designer","Planer","Proyectista","Concepteur","Projetista"]
["Conexión n.º",null,null,"Connessione nr.","Connection no.","Verbindung Nr.","Conexión n.º","Connexion n°","Ligação n.º"]
["Normativa",null,null,"Normativa","Standard","Norm","Normativa","Norme","Normativa"]
["Número eficaz axial (no necesario)",null,null,"Numero efficace assiale (non necessario)","Axial effective number (not required)","Wirksame Anzahl in axialer Richtung (nicht erforderlich)","Número eficaz axial (no necesario)","Nombre efficace axial (non nécessaire)","Número efetivo axial (não necessário)"]
["Número eficaz al corte (no necesario)",null,null,"Numero efficace a taglio (non necessario)","Effective shear number (not necessary)","Wirksame Anzahl in Richtung Querkraft (nicht erforderlich)","Número eficaz al corte (no necesario)","Nombre efficace au cisaillement (non nécessaire)","Número efetivo de corte (não necessário)"]
["Solicitaciones",null,null,"Sollecitazioni","Loads","Beanspruchungen","Solicitaciones","Sollicitations","Carregamentos"]
["Duración de la carga ",null,null,"Durata carico ","Load duration","Lasteinwirkungsdauer ","Duración de la carga ","Durée de la charge ","Duração da carga "]
["Longitud de la unión",null,null,"Lunghezza giunto","Joint length","Länge Verbindung","Longitud de la unión","Longueur de l’assemblage","Comprimento da junta"]
{"$rows_left_out":212}
{"sheet":"Foglio1","index":10,"n_rows":96,"n_cols":40,"rows_kept":96,"hidden":true}
[{"$nulls":28},"L",null,null,"L",{"$nulls":3},"C"]
[{"$nulls":12},"x","y",null,"x","y",{"$nulls":10},{"$f":"IF(I8=\"T\",0,AB3+50)","v":300},{"$f":"IF(I8=\"T\",0,AC3+50)","v":550},null,{"$f":"IF(I8=\"T\",0,AE3+50)","v":1500},{"$f":"IF(I8=\"T\",0,AF3+50)","v":550},{"$nulls":3},{"$f":"IF(I8=\"L\",0,N5/2+50)","v":0},{"$f":"IF(I8=\"L\",0,M4/4+50)","v":0},null,{"$f":"IF(I8=\"L\",0,AJ2++D9+D23)","v":0},{"$f":"IF(I8=\"L\",0,AK2)","v":0}]
[{"$nulls":11},1,{"$f":"0","v":0},0,null,{"$f":"M3+D9+D23","v":1200},{"$f":"N3","v":0},null,0,0,null,{"$f":"P3","v":1200},{"$f":"Q3","v":0},null,{"$f":"D9+5","v":1005},{"$f":"Q3","v":0},null,{"$f":"IF(I8=\"T\",0,M4/4)","v":250},{"$f":"IF(I8=\"T\",0,N5/2)","v":500},null,{"$f":"IF(I8=\"T\",0,AB3+D9+D23)","v":1450},{"$f":"IF(I8=\"T\",0,AC3)","v":500},{"$nulls":3},{"$f":"IF(I8=\"L\",0,N5/2)","v":0},{"$f":"IF(I8=\"L\",0,M4/4)","v":0},null,{"$f":"IF(I8=\"L\",0,AJ3++D9+D23)","v":0},{"$f":"IF(I8=\"L\",0,AK3)","v":0}]
[{"$nulls":11},2,{"$f":"D9","v":1000},0,null,{"$f":"M4+D23+D9","v":2200},{"$f":"N4","v":0},null,0,{"$f":"D9","v":1000},null,{"$f":"0","v":0},{"$f":"Q3","v":0},null,{"$f":"D9-5+D23","v":1195},{"$f":"Q4","v":0},null,{"$f":"IF(I8=\"T\",0,M5-AB3)","v":750},{"$f":"IF(I8=\"T\",0,AC3)","v":500},null,{"$f":"IF(I8=\"T\",0,AB4+D9+D23)","v":1950},{"$f":"IF(I8=\"T\",0,AC4)","v":500},{"$nulls":3},{"$f":"IF(I8=\"L\",0,N5/2)","v":0},{"$f":"IF(I8=\"L\",0,M5-M4/4)","v":0},null,{"$f":"IF(I8=\"L\",0,AJ4++D9+D23)","v":0},{"$f":"IF(I8=\"L\",0,AK4)","v":0}]
[{"$nulls":11},3,{"$f":"M4","v":1000},{"$f":"M4","v":1000},null,{"$f":"M5+D23+D9","v":2200},1000,{"$nulls":7},{"$f":"P5-5-D9","v":1195},1000,null,{"$f":"IF(I8=\"T\",0,AB4-50)","v":700},{"$f":"IF(I8=\"T\",0,AC4-50)","v":450},null,{"$f":"IF(I8=\"T\",0,AE4-50)","v":1900},{"$f":"IF(I8=\"T\",0,AF4-50)","v":450},{"$nulls":3},{"$f":"IF(I8=\"L\",0,N5/2-50)","v":0},{"$f":"IF(I8=\"L\",0,M5-M4/4-50)","v":0},null,{"$f":"IF(I8=\"L\",0,AJ5+D9+D23)","v":0},{"$f":"IF(I8=\"L\",0,AK5)","v":0}]
[{"$nulls":11},4,{"$f":"0","v":0},{"$f":"M5","v":1000},null,{"$f":"M6+D23+D9","v":1200},1000,null,{"$f":"P6","v":1200},{"$f":"Q6","v":1000},{"$nulls":4},{"$f":"D9+5","v":1005},1000]
[{"$nulls":15},{"$f":"P3","v":1200},{"$f":"Q3","v":0},null,{"$f":"S6","v":1200},{"$f":"Q3","v":0},{"$nulls":4},{"$f":"Y3","v":1005},{"$f":"Z3","v":0}]
[{"$nulls":8},{"$f":"GEOMETRY!H34","v":"L"},{"$nulls":15},{"$f":"Y5","v":1195},{"$f":"Z5","v":1000},{"$nulls":5},{"$f":"IF(I8=\"T\",0,1)","v":1}]
[null,null,"b",{"$f":"GEOMETRY!H21","v":1000},"mm",{"$nulls":3},{"$f":"GEOMETRY!$H$32","v":"260mm - 7s - 40 40 30 40 30 40 40"},{"$nulls":15},{"$f":"Y6","v":1005},{"$f":"Z8","v":1000}]
[null,null,"h",{"$f":"GEOMETRY!H33","v":260},"mm",{"$nulls":19},{"$f":"Y8","v":1195},0]
[null,null,"n",{"$f":"IF(--MID(GEOMETRY!H31,3,1)=1,--MID(GEOMETRY!H31,3,2),--MID(GEOMETRY!H31,3,1))","v":7},null,1,{"$f":"IF(F11<$D$11,F11,IF(F11=$D$11,F11,\"\"))","v":1},{"$f":"IF(G11=\"\",\"\",1)","v":1},{"$f":"IF(G11=\"\",\"\",IF(--MID(GEOMETRY!$H$31,3,1)=1,--MID(GEOMETRY!$H$32,15,2),--MID(GEOMETRY!$H$32,14,2)))","v":40},{"$nulls":3},"sup","x","y",null,"inf"]
[{"$nulls":5},2,{"$f":"IF(F12<$D$11,F12,IF(F12=$D$11,F12,\"\"))","v":2},{"$f":"IF(G12=\"\",\"\",1)","v":1},{"$f":"IF(G12=\"\",\"\",IF(--MID(GEOMETRY!$H$31,3,1)=1,--MID(GEOMETRY!$H$32,15+3,2),--MID(GEOMETRY!$H$32,14+3,2)))","v":40},null,null,1,{"$f":"IF(L12>$D$17,\"\",L12)","v":1},{"$f":"IF(M12=\"\",\"\",D19)","v":50},{"$f":"IF(M12=\"\",\"\",$D$16)","v":45},null,{"$f":"IF(L12>$D$18,\"\",L12)","v":1},{"$f":"IF(Q12=\"\",\"\",D20)","v":100},{"$f":"IF(Q12=\"\",\"\",$D$10-$D$16)","v":215}]
[{"$nulls":5},3,3,1,{"$f":"IF(G13=\"\",\"\",IF(--MID(GEOMETRY!$H$31,3,1)=1,--MID(GEOMETRY!$H$32,15+6,2),--MID(GEOMETRY!$H$32,14+6,2)))","v":30},null,null,2,{"$f":"IF(L13>$D$17,\"\",L13)","v":2},{"$f":"IF(M13=\"\",\"\",N12+$D$14)","v":250},{"$f":"IF(M13=\"\",\"\",$D$16)","v":45},null,{"$f":"IF(L13>$D$18,\"\",L13)","v":2},{"$f":"IF(Q13=\"\",\"\",R12+$D$15)","v":300},{"$f":"IF(Q13=\"\",\"\",$D$10-$D$16)","v":215}]
[null,null,"esup",{"$f":"GEOMETRY!H40","v":200},"mm",4,4,1,{"$f":"IF(G14=\"\",\"\",IF(--MID(GEOMETRY!$H$31,3,1)=1,--MID(GEOMETRY!$H$32,15+9,2),--MID(GEOMETRY!$H$32,14+9,2)))","v":40},null,null,3,3,{"$f":"IF(M14=\"\",\"\",N13+$D$14)","v":450},45,null,{"$f":"IF(L14>$D$18,\"\",L14)","v":3},{"$f":"IF(Q14=\"\",\"\",R13+$D$15)","v":500},215]
[null,null,"einf",{"$f":"GEOMETRY!H41","v":200},"mm",5,5,1,{"$f":"IF(G15=\"\",\"\",IF(--MID(GEOMETRY!$H$31,3,1)=1,--MID(GEOMETRY!$H$32,15+12,2),--MID(GEOMETRY!$H$32,14+12,2)))","v":30},null,null,4,4,{"$f":"IF(M15=\"\",\"\",N14+$D$14)","v":650},45,null,{"$f":"IF(L15>$D$18,\"\",L15)","v":4},700,215]
{"$rows_left_out":81}